Reaction Details
TargetNeuronal acetylcholine receptor subunit alpha-4
LigandBDBM50061565
Substrate/Competitorn/a
Ki>10000±n/a nM
CommentsPDSP_1187
Citation Xiao, YKellar, KJ The comparative pharmacology and up-regulation of rat neuronal nicotinic receptor subtype binding sites stably expressed in transfected mammalian cells. J Pharmacol Exp Ther310:98-107 (2004) 
 
Neuronal acetylcholine receptor subunit alpha-4
Name:Neuronal acetylcholine receptor subunit alpha-4
Type:Enzyme
Mol. Mass.:70196.44
Organism:Rattus norvegicus (Rat)
Description:P09483
Residue:630
BDBM50061565
NameBDBM50061565
Synonyms:(+)Methyl-(2,3,3-trimethyl-bicyclo[2.2.1]hept-2-yl)-amine (-)Methyl-(2,3,3-trimethyl-bicyclo[2.2.1]hept-2-yl)-amine MECAMYLAMINE Methyl-(2,3,3-trimethyl-bicyclo[2.2.1]hept-2-yl)-amine(Mecamylamine)
TypeSmall organic molecule
Emp. Form.C11H21N
Mol. Mass.167.2911
SMILESCNC1(C)C2CCC(C2)C1(C)C