Reaction Details
TargetNicotinic acetylcholine receptor
LigandBDBM50061567
Substrate/Competitorn/a
Ki 100±n/a nM
CommentsPDSP_691
Citation Xiao, YKellar, KJ The comparative pharmacology and up-regulation of rat neuronal nicotinic receptor subtype binding sites stably expressed in transfected mammalian cells. J Pharmacol Exp Ther310:98-107 (2004) 
 
Nicotinic acetylcholine receptor
Name:Nicotinic acetylcholine receptor
Type:Enzyme Catalytic Domain
Mol. Mass.:2478.99
Organism:RAT
Description:n-AChR 0 RAT::Q62594
Residue:23
BDBM50061567
NameBDBM50061567
Synonyms:1,1-Dimethyl-4-phenyl-piperazin-1-ium CHEMBL47814 cid_5911
TypeSmall organic molecule
Emp. Form.C12H19N2
Mol. Mass.191.2921
SMILESC[N+]1(C)CCN(CC1)c1ccccc1