Reaction Details
TargetP2X purinoceptor 3
LigandBDBM18136
Substrate/Competitorn/a
Ki>10000±n/a nM
CommentsPDSP_4067
Citation Jarvis, MFBianchi, BUchic, JTCartmell, JLee, CHWilliams, MFaltynek, C [3H]A-317491, a novel high-affinity non-nucleotide antagonist that specifically labels human P2X2/3 and P2X3 receptors. J Pharmacol Exp Ther310:407-16 (2004) 
 
P2X purinoceptor 3
Name:P2X purinoceptor 3
Type:Protein
Mol. Mass.:44292.02
Organism:Homo sapiens (Human)
Description:P56373
Residue:397
BDBM18136
NameBDBM18136
Synonyms:ADP, alpha beta-me [({[(2R,3S,4R,5R)-5-(6-amino-9H-purin-9-yl)-3,4-dihydroxyoxolan-2-yl]methoxy}(hydroxy)phosphoryl)methyl]phosphonic acid cid_92199
TypeNucleoside or nucleotide
Emp. Form.C11H17N5O9P2
Mol. Mass.425.2283
SMILESNc1ncnc2n(cnc12)[C@@H]1O[C@H](COP(O)(=O)CP(O)(O)=O)[C@@H](O)[C@H]1O