Reaction Details
TargetP2X purinoceptor 3
LigandBDBM86484
Substrate/Competitorn/a
Ki 297±n/a nM
CommentsPDSP_4064
Citation Jarvis, MFBianchi, BUchic, JTCartmell, JLee, CHWilliams, MFaltynek, C [3H]A-317491, a novel high-affinity non-nucleotide antagonist that specifically labels human P2X2/3 and P2X3 receptors. J Pharmacol Exp Ther310:407-16 (2004) 
 
P2X purinoceptor 3
Name:P2X purinoceptor 3
Type:Protein
Mol. Mass.:44292.02
Organism:Homo sapiens (Human)
Description:P56373
Residue:397
BDBM86484
NameBDBM86484
Synonyms:ADP, Beta S NSC_123848
TypeSmall organic molecule
Emp. Form.C10H15N5O9P2S
Mol. Mass.443.267
SMILESNc1ncnc2n(cnc12)C1OC(COP(O)(=O)OP(O)(S)=O)C(O)C1O