Reaction Details
TargetP2X purinoceptor 3
LigandBDBM86479
Substrate/Competitorn/a
Ki 40.3±n/a nM
CommentsPDSP_4062
Citation Jarvis, MFBianchi, BUchic, JTCartmell, JLee, CHWilliams, MFaltynek, C [3H]A-317491, a novel high-affinity non-nucleotide antagonist that specifically labels human P2X2/3 and P2X3 receptors. J Pharmacol Exp Ther310:407-16 (2004) 
 
P2X purinoceptor 3
Name:P2X purinoceptor 3
Type:Protein
Mol. Mass.:44292.02
Organism:Homo sapiens (Human)
Description:P56373
Residue:397
BDBM86479
NameBDBM86479
Synonyms:ATP,Gamma S NSC_440317
TypeSmall organic molecule
Emp. Form.C10H16N5O12P3S
Mol. Mass.523.247
SMILESNc1ncnc2n(cnc12)C1OC(COP(O)(=O)OP(O)(=O)OP(O)(O)=S)C(O)C1O