Reaction Details
TargetP2X purinoceptor 2
LigandBDBM86483
Substrate/Competitorn/a
Ki 4.6±n/a nM
CommentsPDSP_4068
Citation Jarvis, MFBianchi, BUchic, JTCartmell, JLee, CHWilliams, MFaltynek, C [3H]A-317491, a novel high-affinity non-nucleotide antagonist that specifically labels human P2X2/3 and P2X3 receptors. J Pharmacol Exp Ther310:407-16 (2004) 
 
P2X purinoceptor 2
Name:P2X purinoceptor 2
Type:Enzyme Catalytic Domain
Mol. Mass.:51765.18
Organism:Homo sapiens (Human)
Description:PurinergicP2X2/3 0 HUMAN::Q9UBL9
Residue:471
BDBM86483
NameBDBM86483
Synonyms:AP4A NSC_175692
TypeSmall organic molecule
Emp. Form.C24H28N10O19P4
Mol. Mass.884.4298
SMILESOC1C(COP(O)(=O)OP(O)(=O)OP(O)(=O)OP(O)(=O)OCC2OC(C(O)C2O)n2cnc3c4nccn4cnc23)OC(C1O)n1cnc2c3nccn3cnc12