Reaction Details
TargetP2X purinoceptor 2
LigandBDBM18135
Substrate/Competitorn/a
Ki 506±n/a nM
CommentsPDSP_4077
Citation Jarvis, MFBianchi, BUchic, JTCartmell, JLee, CHWilliams, MFaltynek, C [3H]A-317491, a novel high-affinity non-nucleotide antagonist that specifically labels human P2X2/3 and P2X3 receptors. J Pharmacol Exp Ther310:407-16 (2004) 
 
P2X purinoceptor 2
Name:P2X purinoceptor 2
Type:Enzyme Catalytic Domain
Mol. Mass.:51765.18
Organism:Homo sapiens (Human)
Description:PurinergicP2X2/3 0 HUMAN::Q9UBL9
Residue:471
BDBM18135
NameBDBM18135
Synonyms:({[({[(2R,3S,4R,5R)-5-(6-amino-9H-purin-9-yl)-3,4-dihydroxyoxolan-2-yl]methoxy}(hydroxy)phosphoryl)oxy](hydroxy)phosphoryl}methyl)phosphonic acid ATP,Beta Gamma-me adenylylmethylenediphosphonate
TypeNucleoside or nucleotide
Emp. Form.C11H18N5O12P3
Mol. Mass.505.2082
SMILESNc1ncnc2n(cnc12)[C@@H]1O[C@H](COP(O)(=O)OP(O)(=O)CP(O)(O)=O)[C@@H](O)[C@H]1O