Reaction Details
TargetHrh3 protein
LigandBDBM86490
Substrate/Competitorn/a
Ki 25.8±n/a nM
CommentsPDSP_895
Citation Hancock, AABennani, YLBush, ENEsbenshade, TAFaghih, RFox, GBJacobson, PKnourek-Segel, VKrueger, KMNuss, MEPan, JBShapiro, RWitte, DGYao, BB Antiobesity effects of A-331440, a novel non-imidazole histamine H3 receptor antagonist. Eur J Pharmacol487:183-97 (2004) 
 
Hrh3 protein
Name:Hrh3 protein
Type:Enzyme Catalytic Domain
Mol. Mass.:37860.96
Organism:RAT
Description:Q5PPG3
Residue:344
BDBM86490
NameBDBM86490
Synonyms:CAS_0 GT 2016 | NSC_0
TypeSmall organic molecule
Emp. Form.C19H31N3O
Mol. Mass.317.4689
SMILESO=C(CCCCC1CCCCC1)N1CCC(CC1)c1cnc[nH]1