Reaction Details
TargetHrh3 protein
LigandBDBM22914
Substrate/Competitorn/a
Ki 3.21±n/a nM
CommentsPDSP_1847
Citation Hancock, AABennani, YLBush, ENEsbenshade, TAFaghih, RFox, GBJacobson, PKnourek-Segel, VKrueger, KMNuss, MEPan, JBShapiro, RWitte, DGYao, BB Antiobesity effects of A-331440, a novel non-imidazole histamine H3 receptor antagonist. Eur J Pharmacol487:183-97 (2004) 
 
Hrh3 protein
Name:Hrh3 protein
Type:Enzyme Catalytic Domain
Mol. Mass.:37860.96
Organism:RAT
Description:Q5PPG3
Residue:344
BDBM22914
NameBDBM22914
Synonyms:CHEMBL260374 Thioperamide | US11622967, Compound Thioperamide
TypeSmall organic molecule
Emp. Form.C15H24N4S
Mol. Mass.292.443
SMILESS=C(NC1CCCCC1)N1CCC(CC1)c1cnc[nH]1