Reaction Details
TargetNeuromedin-B receptor
LigandBDBM86502
Substrate/Competitorn/a
Ki 5.9±n/a nM
CommentsPDSP_3735
Citation Mantey, SACoy, DHEntsuah, LKJensen, RT Development of bombesin analogs with conformationally restricted amino acid substitutions with enhanced selectivity for the orphan receptor human bombesin receptor subtype 3. J Pharmacol Exp Ther310:1161-70 (2004) 
 
Neuromedin-B receptor
Name:Neuromedin-B receptor
Type:Enzyme Catalytic Domain
Mol. Mass.:43447.11
Organism:Homo sapiens (Human)
Description:Bombesin 1 NMBR 0::P28336
Residue:390
BDBM86502
NameBDBM86502
Synonyms:CAS_0 [D-Tyr6,Beta-Ala11,Phe13,Nle14]Bn(6-14)
TypeSmall organic molecule
Emp. Form.C57H76N14O11
Mol. Mass.1133.3005
SMILESCCCC[C@H](NC(=O)[C@H](Cc1ccccc1)NC(=O)[C@H](Cc1cnc[nH]1)NC(=O)CCNC(=O)[C@@H](NC(=O)[C@H](C)NC(=O)[C@H](Cc1c[nH]c2ccccc12)NC(=O)[C@H](CCC(N)=O)NC(=O)[C@H](N)Cc1ccc(O)cc1)C(C)C)C(N)=O