Reaction Details
TargetCannabinoid receptor 2
LigandBDBM86515
Substrate/Competitorn/a
Ki 22.9±n/a nM
CommentsPDSP_1838
Citation De Vry, JDenzer, DReissmueller, EEijckenboom, MHeil, MMeier, HMauler, F 3-[2-cyano-3-(trifluoromethyl)phenoxy]phenyl-4,4,4-trifluoro-1-butanesulfonate (BAY 59-3074): a novel cannabinoid Cb1/Cb2 receptor partial agonist with antihyperalgesic and antiallodynic effects. J Pharmacol Exp Ther310:620-32 (2004) 
 
Cannabinoid receptor 2
Name:Cannabinoid receptor 2
Type:G Protein-Coupled Receptor (GPCR)
Mol. Mass.:39690.94
Organism:Homo sapiens (Human)
Description:P34972
Residue:360
BDBM86515
NameBDBM86515
Synonyms:CAS_1972-08-3 THC, delta 9 | US9416103, Δ9-THC
TypeSmall organic molecule
Emp. Form.C21H30O2
Mol. Mass.314.4617
SMILESCCCCCc1cc(O)c2C3C=C(C)CCC3C(C)(C)Oc2c1