Reaction Details
TargetOpioid receptor delta 1
LigandBDBM86518
Substrate/Competitorn/a
Ki 1000±n/a nM
CommentsPDSP_669
Citation Gilbert, AKHosztafi, SMahurter, LPasternak, GW Pharmacological characterization of dihydromorphine, 6-acetyldihydromorphine and dihydroheroin analgesia and their differentiation from morphine. Eur J Pharmacol492:123-30 (2004) 
 
Opioid receptor delta 1
Name:Opioid receptor delta 1
Synonyms:n/a
Type:PROTEIN
Mol. Mass.:40708.41
Organism:Bos taurus
Description:ChEMBL_863801
Residue:372
BDBM86518
NameBDBM86518
TypeSmall organic molecule
Emp. Form.C17H21NO3
Mol. Mass.287.3535
SMILESCN1CCC23C4Oc5c2c(CC1C3CCC4O)ccc5O