Reaction Details
TargetMu-type opioid receptor
LigandBDBM86518
Substrate/Competitorn/a
Ki 1.3±n/a nM
CommentsPDSP_669
Citation Gilbert, AKHosztafi, SMahurter, LPasternak, GW Pharmacological characterization of dihydromorphine, 6-acetyldihydromorphine and dihydroheroin analgesia and their differentiation from morphine. Eur J Pharmacol492:123-30 (2004) 
 
Mu-type opioid receptor
Name:Mu-type opioid receptor
Type:Enzyme Catalytic Domain
Mol. Mass.:45038.37
Organism:CALF
Description:OPIATE Mu 2 0 CALF::P79350
Residue:401
BDBM86518
NameBDBM86518
Synonyms:CAS_509-60-4 NSC_273032
TypeSmall organic molecule
Emp. Form.C17H21NO3
Mol. Mass.287.3535
SMILESCN1CCC23C4Oc5c2c(CC1C3CCC4O)ccc5O