Reaction Details
Target5-hydroxytryptamine receptor 2B
LigandBDBM50249134
Substrate/Competitorn/a
Ki 1.07±n/a nM
CommentsPDSP_3873
Citation Knight, ARMisra, AQuirk, KBenwell, KRevell, DKennett, GBickerdike, M Pharmacological characterisation of the agonist radioligand binding site of 5-HT(2A), 5-HT(2B) and 5-HT(2C) receptors. Naunyn Schmiedebergs Arch Pharmacol370:114-23 (2004) 
 
5-hydroxytryptamine receptor 2B
Name:5-hydroxytryptamine receptor 2B
Type:G Protein-Coupled Receptor (GPCR)
Mol. Mass.:54312.47
Organism:Homo sapiens (Human)
Description:Receptor binding assays were performed using human clone stably expressed in CHO cells.
Residue:481
BDBM50249134
NameBDBM50249134
Synonyms:4-(4-fluoronaphthalen-1-yl)-6-isopropylpyrimidin-2-amine RS-127445
TypeSmall organic molecule
Emp. Form.C17H16FN3
Mol. Mass.281.3274
SMILESCC(C)c1cc(nc(N)n1)-c1ccc(F)c2ccccc12