Reaction Details
TargetCannabinoid receptor 1
LigandBDBM86539
Substrate/Competitorn/a
Ki 2400±n/a nM
CommentsPDSP_4176
Citation Appendino, GDe Petrocellis, LTrevisani, MMinassi, ADaddario, NMoriello, ASGazzieri, DLigresti, ACampi, BFontana, GPinna, CGeppetti, PDi Marzo, V Development of the first ultra-potent "capsaicinoid" agonist at transient receptor potential vanilloid type 1 (TRPV1) channels and its therapeutic potential. J Pharmacol Exp Ther312:561-70 (2005) 
 
Cannabinoid receptor 1
Name:Cannabinoid receptor 1
Type:G Protein-Coupled Receptor (GPCR)
Mol. Mass.:52868.96
Organism:Homo sapiens (Human)
Description:P21554
Residue:472
BDBM86539
NameBDBM86539
Synonyms:PhAR, ent
TypeSmall organic molecule
Emp. Form.C34H49NO5
Mol. Mass.551.7566
SMILESCCCCCCC(C\C=C\CCCCCCCC(=O)NCc1ccc(O)c(OC)c1)OC(=O)Cc1ccccc1