Reaction Details
TargetCannabinoid receptor 2
LigandBDBM86533
Substrate/Competitorn/a
Ki 6000±n/a nM
CommentsPDSP_4178
Citation Appendino, GDe Petrocellis, LTrevisani, MMinassi, ADaddario, NMoriello, ASGazzieri, DLigresti, ACampi, BFontana, GPinna, CGeppetti, PDi Marzo, V Development of the first ultra-potent "capsaicinoid" agonist at transient receptor potential vanilloid type 1 (TRPV1) channels and its therapeutic potential. J Pharmacol Exp Ther312:561-70 (2005) 
 
Cannabinoid receptor 2
Name:Cannabinoid receptor 2
Type:G Protein-Coupled Receptor (GPCR)
Mol. Mass.:39690.94
Organism:Homo sapiens (Human)
Description:P34972
Residue:360
BDBM86533
NameBDBM86533
Synonyms:PhAR, epoxy
TypeSmall organic molecule
Emp. Form.C34H49NO6
Mol. Mass.567.756
SMILESCCCCCCC(CCC1OC1CCCCCCC(=O)NCc1ccc(O)c(OC)c1)OC(=O)Cc1ccccc1