Reaction Details
TargetCannabinoid receptor 2
LigandBDBM86534
Substrate/Competitorn/a
Ki 1400±n/a nM
CommentsPDSP_4177
Citation Appendino, GDe Petrocellis, LTrevisani, MMinassi, ADaddario, NMoriello, ASGazzieri, DLigresti, ACampi, BFontana, GPinna, CGeppetti, PDi Marzo, V Development of the first ultra-potent "capsaicinoid" agonist at transient receptor potential vanilloid type 1 (TRPV1) channels and its therapeutic potential. J Pharmacol Exp Ther312:561-70 (2005) 
 
Cannabinoid receptor 2
Name:Cannabinoid receptor 2
Type:G Protein-Coupled Receptor (GPCR)
Mol. Mass.:39690.94
Organism:Homo sapiens (Human)
Description:P34972
Residue:360
BDBM86534
NameBDBM86534
Synonyms:Rinvanil, Benzoil
TypeSmall organic molecule
Emp. Form.C33H47NO5
Mol. Mass.537.73
SMILESCCCCCC[C@H](CC=CCCCCCCCC(=O)NCc1ccc(O)c(OC)c1)OC(=O)c1ccccc1