Reaction Details
TargetFatty-acid amide hydrolase 1 [30-579]
LigandBDBM86531
Substrate/Competitorn/a
Ki>10000±n/a nM
CommentsPDSP_4180
Citation Appendino, GDe Petrocellis, LTrevisani, MMinassi, ADaddario, NMoriello, ASGazzieri, DLigresti, ACampi, BFontana, GPinna, CGeppetti, PDi Marzo, V Development of the first ultra-potent "capsaicinoid" agonist at transient receptor potential vanilloid type 1 (TRPV1) channels and its therapeutic potential. J Pharmacol Exp Ther312:561-70 (2005) 
 
Fatty-acid amide hydrolase 1 [30-579]
Name:Fatty-acid amide hydrolase 1 [30-579]
Type:Single-pass membrane protein; homodimer
Mol. Mass.:60474.00
Organism:Rattus norvegicus (rat)
Description:P97612 (aa 30-579)
Residue:550
BDBM86531
NameBDBM86531
Synonyms:PhAR, Di-hydro
TypeSmall organic molecule
Emp. Form.C34H51NO5
Mol. Mass.553.7724
SMILESCCCCCCC(CCCCCCCCCCC(=O)NCc1ccc(O)c(OC)c1)OC(=O)Cc1ccccc1