Reaction Details
TargetFatty-acid amide hydrolase 1 [30-579]
LigandBDBM86532
Substrate/Competitorn/a
Ki>10000±n/a nM
CommentsPDSP_4173
Citation Appendino, GDe Petrocellis, LTrevisani, MMinassi, ADaddario, NMoriello, ASGazzieri, DLigresti, ACampi, BFontana, GPinna, CGeppetti, PDi Marzo, V Development of the first ultra-potent "capsaicinoid" agonist at transient receptor potential vanilloid type 1 (TRPV1) channels and its therapeutic potential. J Pharmacol Exp Ther312:561-70 (2005) 
 
Fatty-acid amide hydrolase 1 [30-579]
Name:Fatty-acid amide hydrolase 1 [30-579]
Type:Single-pass membrane protein; homodimer
Mol. Mass.:60474.00
Organism:Rattus norvegicus (rat)
Description:P97612 (aa 30-579)
Residue:550
BDBM86532
NameBDBM86532
Synonyms:Rinvanil
TypeSmall organic molecule
Emp. Form.C26H43NO4
Mol. Mass.433.6239
SMILESCCCCCC[C@@H](O)CC=CCCCCCCCC(=O)NCc1ccc(O)c(OC)c1