Reaction Details
TargetNeuronal acetylcholine receptor subunit alpha-4
LigandBDBM50047021
Substrate/Competitorn/a
Ki 12.1±n/a nM
CommentsPDSP_1086
Citation Grinevich, VPLetchworth, SRLindenberger, KAMenager, JMary, VSadieva, KABuhlman, LMBohme, GAPradier, LBenavides, JLukas, RJBencherif, M Heterologous expression of human {alpha}6{beta}4{beta}3{alpha}5 nicotinic acetylcholine receptors: binding properties consistent with their natural expression require quaternary subunit assembly including the {alpha}5 subunit. J Pharmacol Exp Ther312:619-26 (2005) 
 
Neuronal acetylcholine receptor subunit alpha-4
Name:Neuronal acetylcholine receptor subunit alpha-4
Type:Enzyme
Mol. Mass.:70196.44
Organism:Rattus norvegicus (Rat)
Description:P09483
Residue:630
BDBM50047021
NameBDBM50047021
Synonyms:2-(6-(2-hydroxy-2-phenylethyl)-1-methylpiperidin-2-yl)-1-phenylethanone 2-[6-(2-Hydroxy-2-phenyl-ethyl)-1-methyl-piperidin-2-yl]-1-phenyl-ethanone (lobeline) Lobeline Lobeline,Alpha
TypeSmall organic molecule
Emp. Form.C22H27NO2
Mol. Mass.337.4553
SMILESCN1C(CC(O)c2ccccc2)CCCC1CC(=O)c1ccccc1