Reaction Details
TargetNeuronal acetylcholine receptor subunit alpha-5
LigandBDBM50171347
Substrate/Competitorn/a
Ki 8.71±n/a nM
CommentsPDSP_218
Citation Grinevich, VPLetchworth, SRLindenberger, KAMenager, JMary, VSadieva, KABuhlman, LMBohme, GAPradier, LBenavides, JLukas, RJBencherif, M Heterologous expression of human {alpha}6{beta}4{beta}3{alpha}5 nicotinic acetylcholine receptors: binding properties consistent with their natural expression require quaternary subunit assembly including the {alpha}5 subunit. J Pharmacol Exp Ther312:619-26 (2005) 
 
Neuronal acetylcholine receptor subunit alpha-5
Name:Neuronal acetylcholine receptor subunit alpha-5
Type:Enzyme Catalytic Domain
Mol. Mass.:51875.01
Organism:RAT
Description:Cholinergic, Nicotinic Alpha6Beta3Beta4Alpha5 0 RAT::P20420
Residue:452
BDBM50171347
NameBDBM50171347
Synonyms:3-(Azetidin-2-ylmethoxy)-pyridine CHEMBL190589
TypeSmall organic molecule
Emp. Form.C9H12N2O
Mol. Mass.164.2044
SMILESC(Oc1cccnc1)C1CCN1