Reaction Details
TargetNeuronal acetylcholine receptor subunit alpha-5
LigandBDBM50171341
Substrate/Competitorn/a
Ki 803±n/a nM
CommentsPDSP_222
Citation Grinevich, VPLetchworth, SRLindenberger, KAMenager, JMary, VSadieva, KABuhlman, LMBohme, GAPradier, LBenavides, JLukas, RJBencherif, M Heterologous expression of human {alpha}6{beta}4{beta}3{alpha}5 nicotinic acetylcholine receptors: binding properties consistent with their natural expression require quaternary subunit assembly including the {alpha}5 subunit. J Pharmacol Exp Ther312:619-26 (2005) 
 
Neuronal acetylcholine receptor subunit alpha-5
Name:Neuronal acetylcholine receptor subunit alpha-5
Type:Enzyme Catalytic Domain
Mol. Mass.:51875.01
Organism:RAT
Description:Cholinergic, Nicotinic Alpha6Beta3Beta4Alpha5 0 RAT::P20420
Residue:452
BDBM50171341
NameBDBM50171341
Synonyms:3-Methyl-5-(1-methyl-pyrrolidin-2-yl)-isoxazole CHEMBL188981
TypeSmall organic molecule
Emp. Form.C9H14N2O
Mol. Mass.166.2203
SMILESCN1CCCC1c1cc(C)no1