Reaction Details
TargetNeuronal acetylcholine receptor subunit alpha-5
LigandBDBM82546
Substrate/Competitorn/a
Ki 969±n/a nM
CommentsPDSP_1165
Citation Grinevich, VPLetchworth, SRLindenberger, KAMenager, JMary, VSadieva, KABuhlman, LMBohme, GAPradier, LBenavides, JLukas, RJBencherif, M Heterologous expression of human {alpha}6{beta}4{beta}3{alpha}5 nicotinic acetylcholine receptors: binding properties consistent with their natural expression require quaternary subunit assembly including the {alpha}5 subunit. J Pharmacol Exp Ther312:619-26 (2005) 
 
Neuronal acetylcholine receptor subunit alpha-5
Name:Neuronal acetylcholine receptor subunit alpha-5
Type:Enzyme Catalytic Domain
Mol. Mass.:51875.01
Organism:RAT
Description:Cholinergic, Nicotinic Alpha6Beta3Beta4Alpha5 0 RAT::P20420
Residue:452
BDBM82546
NameBDBM82546
Synonyms:CAS_14721-69-8 N-methylcarbamylcholine | NMCC
TypeSmall organic molecule
Emp. Form.C7H17N2O2
Mol. Mass.161.2215
SMILESCNC(=O)OCC[N+](C)(C)C