Reaction Details
TargetNeuronal acetylcholine receptor subunit alpha-7
LigandBDBM50079456
Substrate/Competitorn/a
Ki 12.4±n/a nM
CommentsPDSP_4099
Citation Grinevich, VPLetchworth, SRLindenberger, KAMenager, JMary, VSadieva, KABuhlman, LMBohme, GAPradier, LBenavides, JLukas, RJBencherif, M Heterologous expression of human {alpha}6{beta}4{beta}3{alpha}5 nicotinic acetylcholine receptors: binding properties consistent with their natural expression require quaternary subunit assembly including the {alpha}5 subunit. J Pharmacol Exp Ther312:619-26 (2005) 
 
Neuronal acetylcholine receptor subunit alpha-7
Name:Neuronal acetylcholine receptor subunit alpha-7
Type:Enzyme
Mol. Mass.:56502.44
Organism:Rattus norvegicus (Rat)
Description:Q05941
Residue:502
BDBM50079456
NameBDBM50079456
Synonyms:2-Pyridin-3-yl-1-aza-bicyclo[2.2.2]octane TC-2429
TypeSmall organic molecule
Emp. Form.C12H16N2
Mol. Mass.188.2688
SMILESC1CN2CCC1CC2c1cccnc1