Reaction Details
TargetKappa-type opioid receptor
LigandBDBM50092521
Substrate/Competitorn/a
Ki 73.6±n/a nM
CommentsPDSP_3760
Citation Wang, YTang, KInan, SSiebert, DHolzgrabe, ULee, DYHuang, PLi, JGCowan, ALiu-Chen, LY Comparison of pharmacological activities of three distinct kappa ligands (Salvinorin A, TRK-820 and 3FLB) on kappa opioid receptors in vitro and their antipruritic and antinociceptive activities in vivo. J Pharmacol Exp Ther312:220-30 (2005) 
 
Kappa-type opioid receptor
Name:Kappa-type opioid receptor
Type:G Protein-Coupled Receptor (GPCR)
Mol. Mass.:42648.76
Organism:Homo sapiens (Human)
Description:P41145
Residue:380
BDBM50092521
NameBDBM50092521
Synonyms:3-((3-Fluoro-phenyl)-{[(3-fluoro-phenyl)-methoxycarbonyl-methyl]-methyl-amino}-methyl)-1-methyl-4-oxo-piperidine-3-carboxylic acid methyl ester CHEMBL447234
TypeSmall organic molecule
Emp. Form.C25H26F2N2O5
Mol. Mass.472.4811
SMILESCOC(=O)C12CN(C)CC(C(N(C)C1c1cccc(F)c1)c1cccc(F)c1)(C(=O)OC)C2=O