Reaction Details
TargetMu-type opioid receptor
LigandBDBM86253
Substrate/Competitorn/a
Ki 8.9±n/a nM
CommentsPDSP_616
Citation Wang, YTang, KInan, SSiebert, DHolzgrabe, ULee, DYHuang, PLi, JGCowan, ALiu-Chen, LY Comparison of pharmacological activities of three distinct kappa ligands (Salvinorin A, TRK-820 and 3FLB) on kappa opioid receptors in vitro and their antipruritic and antinociceptive activities in vivo. J Pharmacol Exp Ther312:220-30 (2005) 
 
Mu-type opioid receptor
Name:Mu-type opioid receptor
Type:G Protein-Coupled Receptor (GPCR)
Mol. Mass.:44503.11
Organism:Rattus norvegicus (rat)
Description:Competition binding assays were carried out using membrane preparations from transfected HN9.10 cells that constitutively expressed the mu opioid receptor.
Residue:398
BDBM86253
NameBDBM86253
Synonyms:CAS_100929-53-1 NSC_104742 | US10836728, Compound DAMGO
TypeSmall organic molecule
Emp. Form.C26H35N5O6
Mol. Mass.513.586
SMILESCC(NC(=O)C(N)Cc1ccc(O)cc1)C(=O)NCC(=O)N(C)C(Cc1ccccc1)C(=O)NCCO