Reaction Details
TargetHistamine H2 receptor
LigandBDBM50159110
Substrate/Competitorn/a
Ki>10000±n/a nM
CommentsPDSP_3762
Citation Barbier, AJBerridge, CDugovic, CLaposky, ADWilson, SJBoggs, JAluisio, LLord, BMazur, CPudiak, CMLanglois, XXiao, WApodaca, RCarruthers, NILovenberg, TW Acute wake-promoting actions of JNJ-5207852, a novel, diamine-based H3 antagonist. Br J Pharmacol143:649-61 (2004) 
 
Histamine H2 receptor
Name:Histamine H2 receptor
Type:G Protein-Coupled Receptor (GPCR)
Mol. Mass.:40115.31
Organism:Homo sapiens (Human)
Description:n/a
Residue:359
BDBM50159110
NameBDBM50159110
Synonyms:1-(3-(4-(piperidin-1-ylmethyl)phenoxy)propyl)piperidine 1-[3-(4-hexahydro-1-pyridinylmethylphenoxy)propyl]hexahydropyridine CHEMBL129542 | JNJ-5207852
TypeSmall organic molecule
Emp. Form.C20H32N2O
Mol. Mass.316.4809
SMILESC(COc1ccc(CN2CCCCC2)cc1)CN1CCCCC1