Reaction Details
TargetAurora kinase A
LigandBDBM86597
Substrate/Competitorn/a
Meas. Tech.In Vitro Kinase Assay
IC50 1210±0.0 nM
Citation Kwiatkowski, NDeng, XWang, JTan, LVilla, FSantaguida, SHuang, HCMitchison, TMusacchio, AGray, N Selective aurora kinase inhibitors identified using a taxol-induced checkpoint sensitivity screen. ACS Chem Biol7:185-96 (2012) 
 
Aurora kinase A
Name:Aurora kinase A
Type:Serine/threonine-protein kinase
Mol. Mass.:45830.98
Organism:Homo sapiens (Human)
Description:O14965
Residue:403
BDBM86597
NameBDBM86597
Synonyms:Benzo[e]pyrimido[5,4-b][1,4]diazepin-6(11H)-one, 2
TypeSmall organic molecule
Emp. Form.C25H29N7O2
Mol. Mass.459.5435
SMILESCOC1CN(C)CCN1c1ccc(Nc2ncc3N(C)C(=O)c4ccccc4N(C)c3n2)cc1