Reaction Details
TargetAurora kinase A
LigandBDBM86613
Substrate/Competitorn/a
Meas. Tech.In Vitro Kinase Assay
IC50 5.1±0.0 nM
Citation Kwiatkowski, NDeng, XWang, JTan, LVilla, FSantaguida, SHuang, HCMitchison, TMusacchio, AGray, N Selective aurora kinase inhibitors identified using a taxol-induced checkpoint sensitivity screen. ACS Chem Biol7:185-96 (2012) 
 
Aurora kinase A
Name:Aurora kinase A
Type:Serine/threonine-protein kinase
Mol. Mass.:45830.98
Organism:Homo sapiens (Human)
Description:O14965
Residue:403
BDBM86613
NameBDBM86613
Synonyms:Benzo[e]pyrimido[5,4-b][1,4]diazepin-6(11H)-one, 19
TypeSmall organic molecule
Emp. Form.C26H25F3N6O3
Mol. Mass.526.5103
SMILESCN1c2ccccc2C(=O)N(C)c2cnc(Nc3ccc(C(=O)N4CCC(O)CC4)c(c3)C(F)(F)F)nc12