Reaction Details
TargetAurora kinase A
LigandBDBM86614
Substrate/Competitorn/a
Meas. Tech.In Vitro Kinase Assay
IC50 3.2±0.0 nM
Citation Kwiatkowski, NDeng, XWang, JTan, LVilla, FSantaguida, SHuang, HCMitchison, TMusacchio, AGray, N Selective aurora kinase inhibitors identified using a taxol-induced checkpoint sensitivity screen. ACS Chem Biol7:185-96 (2012) 
 
Aurora kinase A
Name:Aurora kinase A
Type:Serine/threonine-protein kinase
Mol. Mass.:45830.98
Organism:Homo sapiens (Human)
Description:O14965
Residue:403
BDBM86614
NameBDBM86614
Synonyms:Benzo[e]pyrimido[5,4-b][1,4]diazepin-6(11H)-one, 20
TypeSmall organic molecule
Emp. Form.C25H25ClN6O3
Mol. Mass.492.957
SMILESCN1c2ccccc2C(=O)N(C)c2cnc(Nc3ccc(C(=O)N4CCC(O)CC4)c(Cl)c3)nc12