Reaction Details
TargetAurora kinase A
LigandBDBM86619
Substrate/Competitorn/a
Meas. Tech.In Vitro Kinase Assay
IC50 102±0.0 nM
Citation Kwiatkowski, NDeng, XWang, JTan, LVilla, FSantaguida, SHuang, HCMitchison, TMusacchio, AGray, N Selective aurora kinase inhibitors identified using a taxol-induced checkpoint sensitivity screen. ACS Chem Biol7:185-96 (2012) 
 
Aurora kinase A
Name:Aurora kinase A
Type:Serine/threonine-protein kinase
Mol. Mass.:45830.98
Organism:Homo sapiens (Human)
Description:O14965
Residue:403
BDBM86619
NameBDBM86619
Synonyms:Benzo[e]pyrimido[5,4-b][1,4]diazepin-6(11H)-one, 25
TypeSmall organic molecule
Emp. Form.C31H36F3N7O
Mol. Mass.579.659
SMILESCCN1CCN(Cc2ccc(Nc3ncc4N(C)C(=O)c5ccccc5N(C5CCCC5)c4n3)cc2C(F)(F)F)CC1