Reaction Details
TargetAurora kinase B
LigandBDBM86623
Substrate/Competitorn/a
Meas. Tech.In Vitro Kinase Assay
IC50 487±0.0 nM
Citation Kwiatkowski, NDeng, XWang, JTan, LVilla, FSantaguida, SHuang, HCMitchison, TMusacchio, AGray, N Selective aurora kinase inhibitors identified using a taxol-induced checkpoint sensitivity screen. ACS Chem Biol7:185-96 (2012) 
 
Aurora kinase B
Name:Aurora kinase B
Type:Protein
Mol. Mass.:39327.72
Organism:Homo sapiens (Human)
Description:Q96GD4
Residue:344
BDBM86623
NameBDBM86623
Synonyms:Benzo[e]pyrimido[5,4-b][1,4]diazepin-6(11H)-one, 29
TypeSmall organic molecule
Emp. Form.C27H29F4N7O
Mol. Mass.543.5591
SMILESCCN1CCN(Cc2ccc(Nc3ncc4N(C)C(=O)c5cccc(F)c5N(C)c4n3)cc2C(F)(F)F)CC1