Reaction Details
TargetAurora kinase B
LigandBDBM50241089
Substrate/Competitorn/a
Meas. Tech.In Vitro Kinase Assay
IC50 15.5±0.0 nM
Citation Kwiatkowski, NDeng, XWang, JTan, LVilla, FSantaguida, SHuang, HCMitchison, TMusacchio, AGray, N Selective aurora kinase inhibitors identified using a taxol-induced checkpoint sensitivity screen. ACS Chem Biol7:185-96 (2012) 
 
Aurora kinase B
Name:Aurora kinase B
Type:Protein
Mol. Mass.:39327.72
Organism:Homo sapiens (Human)
Description:Q96GD4
Residue:344
BDBM50241089
NameBDBM50241089
Synonyms:2-(ethyl(3-(4-(5-(2-(3-fluorophenylamino)-2-oxoethyl)-1H-pyrazol-3-ylamino)quinazolin-7-yloxy)propyl)amino)ethyl dihydrogen phosphate AZD1152, 33 | CHEMBL415049
TypeSmall organic molecule
Emp. Form.C26H31FN7O6P
Mol. Mass.587.5398
SMILESCCN(CCCOc1ccc2c(Nc3cc(CC(=O)Nc4cccc(F)c4)n[nH]3)ncnc2c1)CCOP(O)(O)=O