Reaction Details
TargetcAMP and cAMP-inhibited cGMP 3',5'-cyclic phosphodiesterase 10A
LigandBDBM86644
Substrate/Competitorn/a
Meas. Tech.In Vitro Enzyme Assay
IC50 5e+3±n/a nM
Citation Ceyhan, OBirsoy, KHoffman, CS Identification of biologically active PDE11-selective inhibitors using a yeast-based high-throughput screen. Chem Biol19:155-63 (2012) 
 
cAMP and cAMP-inhibited cGMP 3',5'-cyclic phosphodiesterase 10A
Name:cAMP and cAMP-inhibited cGMP 3',5'-cyclic phosphodiesterase 10A
Type:Protein
Mol. Mass.:88412.52
Organism:Homo sapiens (Human)
Description:Q9Y233
Residue:779
BDBM86644
NameBDBM86644
Synonyms:BC11-38-2 | US9173884, BC11-38-2
TypeSmall organic molecule
Emp. Form.C16H18N2OS2
Mol. Mass.318.457
SMILESCCC(C)Sc1nc2CCSc2c(=O)n1-c1ccccc1