Reaction Details
TargetDual 3',5'-cyclic-AMP and -GMP phosphodiesterase 11A
LigandBDBM60812
Substrate/Competitorn/a
Meas. Tech.In Vitro Enzyme Assay
IC50 110±n/a nM
Citation Ceyhan, OBirsoy, KHoffman, CS Identification of biologically active PDE11-selective inhibitors using a yeast-based high-throughput screen. Chem Biol19:155-63 (2012) 
 
Dual 3',5'-cyclic-AMP and -GMP phosphodiesterase 11A
Name:Dual 3',5'-cyclic-AMP and -GMP phosphodiesterase 11A
Type:Enzyme
Mol. Mass.:104751.53
Organism:Homo sapiens (Human)
Description:Q9HCR9
Residue:933
BDBM60812
NameBDBM60812
Synonyms:BDBM86641 | US9173884, BC11-28
Typen/a
Emp. Form.C25H19FN4
Mol. Mass.394.4436
SMILESCc1ccccc1Nc1ncnc2n(cc(-c3ccccc3)c12)-c1ccc(F)cc1