Reaction Details
TargetDelta-type opioid receptor
LigandBDBM50068658
Substrate/Competitorn/a
Ki 2.9±n/a nM
CommentsPDSP_2917
Citation Tryoen-Tóth, PDécaillot, FMFilliol, DBefort, KLazarus, LHSchiller, PWSchmidhammer, HKieffer, BL Inverse agonism and neutral antagonism at wild-type and constitutively active mutant delta opioid receptors. J Pharmacol Exp Ther313:410-21 (2005) 
 
Delta-type opioid receptor
Name:Delta-type opioid receptor
Type:G Protein-Coupled Receptor (GPCR)
Mol. Mass.:40382.98
Organism:Homo sapiens (Human)
Description:Competition binding assays were carried out using membrane preparations from transfected HN9.10 cells that constitutively expressed the delta opioid receptor.
Residue:372
BDBM50068658
NameBDBM50068658
Synonyms:2-[2-({2-[2-Amino-3-(4-hydroxy-phenyl)-propionyl]-1,2,3,4-tetrahydro-isoquinoline-3-carbonyl}-amino)-3-phenyl-propionylamino]-3-phenyl-propionic acid TIPP
TypeSmall organic molecule
Emp. Form.C37H38N4O6
Mol. Mass.634.7208
SMILESNC(Cc1ccc(O)cc1)C(=O)N1Cc2ccccc2CC1C(=O)NC(Cc1ccccc1)C(=O)NC(Cc1ccccc1)C(O)=O