Reaction Details
TargetHistamine H3 receptor
LigandBDBM50074629
Substrate/Competitorn/a
Ki 12.30±n/a nM
CommentsPDSP_4081
Citation Esbenshade, TAFox, GBKrueger, KMMiller, TRKang, CHDenny, LIWitte, DGYao, BBPan, LWetter, JMarsh, KBennani, YLCowart, MDSullivan, JPHancock, AA Pharmacological properties of ABT-239 [4-(2-{2-[(2R)-2-Methylpyrrolidinyl]ethyl}-benzofuran-5-yl)benzonitrile]: I. Potent and selective histamine H3 receptor antagonist with drug-like properties. J Pharmacol Exp Ther313:165-75 (2005) 
 
Histamine H3 receptor
Name:Histamine H3 receptor
Type:G Protein-Coupled Receptor (GPCR)
Mol. Mass.:48691.47
Organism:Homo sapiens (Human)
Description:Binding assays were using CHO cells stably expressing hH3R receptors.
Residue:445
BDBM50074629
NameBDBM50074629
Synonyms:4-[(1R,2R)-2-(5,5-Dimethyl-hex-1-ynyl)-cyclopropyl]-1H-imidazole Cipralisant
TypeSmall organic molecule
Emp. Form.C14H20N2
Mol. Mass.216.322
SMILESCC(C)(C)CCC#C[C@@H]1C[C@H]1c1cnc[nH]1