Reaction Details
TargetThromboxane A2 receptor
LigandBDBM50188619
Substrate/Competitorn/a
Ki 1.3±n/a nM
CommentsPDSP_4501
Citation Hanson, JRolin, SReynaud, DQiao, NKelley, LPReid, HMValentin, FTippins, JKinsella, BTMasereel, BPace-Asciak, CPirotte, BDogné, JM In vitro and in vivo pharmacological characterization of BM-613 [N-n-pentyl-N'-[2-(4'-methylphenylamino)-5-nitrobenzenesulfonyl]urea], a novel dual thromboxane synthase inhibitor and thromboxane receptor antagonist. J Pharmacol Exp Ther313:293-301 (2005) 
 
Thromboxane A2 receptor
Name:Thromboxane A2 receptor
Type:Enyzme
Mol. Mass.:37445.28
Organism:Homo sapiens (Human)
Description:P21731
Residue:343
BDBM50188619
NameBDBM50188619
Synonyms:1-(2-(p-toluidino)-5-nitrophenylsulfonyl)-3-tert-butylurea BM-573 N-tert-butyl-N'-[2-(4-methylphenylamino)-5-nitrobenzenesulfonyl]urea
TypeSmall organic molecule
Emp. Form.C18H22N4O5S
Mol. Mass.406.456
SMILESCc1ccc(Nc2ccc(cc2S(=O)(=O)NC(=O)NC(C)(C)C)[N+]([O-])=O)cc1