Reaction Details
TargetThromboxane-A synthase
LigandBDBM50188619
Substrate/Competitorn/a
Ki 1.1±n/a nM
CommentsPDSP_4501
Citation Hanson, JRolin, SReynaud, DQiao, NKelley, LPReid, HMValentin, FTippins, JKinsella, BTMasereel, BPace-Asciak, CPirotte, BDogné, JM In vitro and in vivo pharmacological characterization of BM-613 [N-n-pentyl-N'-[2-(4'-methylphenylamino)-5-nitrobenzenesulfonyl]urea], a novel dual thromboxane synthase inhibitor and thromboxane receptor antagonist. J Pharmacol Exp Ther313:293-301 (2005) 
 
Thromboxane-A synthase
Name:Thromboxane-A synthase
Type:Enzyme
Mol. Mass.:60524.67
Organism:Homo sapiens (Human)
Description:P24557
Residue:533
BDBM50188619
NameBDBM50188619
Synonyms:1-(2-(p-toluidino)-5-nitrophenylsulfonyl)-3-tert-butylurea BM-573 N-tert-butyl-N'-[2-(4-methylphenylamino)-5-nitrobenzenesulfonyl]urea
TypeSmall organic molecule
Emp. Form.C18H22N4O5S
Mol. Mass.406.456
SMILESCc1ccc(Nc2ccc(cc2S(=O)(=O)NC(=O)NC(C)(C)C)[N+]([O-])=O)cc1