Reaction Details
TargetPolyunsaturated fatty acid 5-lipoxygenase
LigandBDBM86692
Substrate/Competitorn/a
Ki>10000±n/a nM
CommentsPDSP_4863
Citation Mimura, HIkemura, TKotera, OSawada, MTashiro, SFuse, EUeno, KManabe, HOhshima, EKarasawa, AMiyaji, H Inhibitory effect of the 4-aminotetrahydroquinoline derivatives, selective chemoattractant receptor-homologous molecule expressed on T helper 2 cell antagonists, on eosinophil migration induced by prostaglandin D2. J Pharmacol Exp Ther314:244-51 (2005) 
 
Polyunsaturated fatty acid 5-lipoxygenase
Name:Polyunsaturated fatty acid 5-lipoxygenase
Type:Enzyme
Mol. Mass.:77972.74
Organism:Homo sapiens (Human)
Description:Recombinant protein was purified from E. coli lysate. After ammonium sulfate precipitation and subsequent steps, the supernatant (S100) was used for 5-LO activity assay.
Residue:674
BDBM86692
NameBDBM86692
Synonyms:K117
TypeSmall organic molecule
Emp. Form.C27H28N2O2
Mol. Mass.412.5234
SMILESCC(C)C(=O)N(C1CC(C)N(C(=O)c2ccccc2)c2ccccc12)c1ccccc1