Reaction Details
TargetGamma-aminobutyric acid receptor subunit alpha-1
LigandBDBM86694
Substrate/Competitorn/a
Ki>10000±n/a nM
CommentsPDSP_4918
Citation Miyata, NSeki, TTanaka, YOmura, TTaniguchi, KDoi, MBandou, KKametani, SSato, MOkuyama, SCambj-Sapunar, LHarder, DRRoman, RJ Beneficial effects of a new 20-hydroxyeicosatetraenoic acid synthesis inhibitor, TS-011 [N-(3-chloro-4-morpholin-4-yl) phenyl-N'-hydroxyimido formamide], on hemorrhagic and ischemic stroke. J Pharmacol Exp Ther314:77-85 (2005) 
 
Gamma-aminobutyric acid receptor subunit alpha-1
Name:Gamma-aminobutyric acid receptor subunit alpha-1
Type:Enzyme
Mol. Mass.:51770.21
Organism:Rattus norvegicus (Rat)
Description:P62813
Residue:455
BDBM86694
NameBDBM86694
Synonyms:N'-(3-Chloro-4-morpholinophenyl)-N-hydroxyformamidine | TS-011
TypeSmall organic molecule
Emp. Form.C11H14ClN3O2
Mol. Mass.255.701
SMILESONC=Nc1ccc(N2CCOCC2)c(Cl)c1