Reaction Details
TargetInhibitor of nuclear factor kappa-B kinase subunit epsilon
LigandBDBM278079
Substrate/Competitorn/a
Meas. Tech.TBK1 and IKKE Biological Assays
pH7±n/a
IC50<1±n/a nM
Commentsextracted
Citation Du, ZGuerrero, JAKaplan, JAKnox, Jr., JELo, JRMitchell, SANaduthambi, DPhillips, BWVenkataramani, CWang, PWatkins, WJZhao, Z Tank-binding kinase inhibitor compounds US Patent US10040781 Publication Date 8/7/2018
 
Inhibitor of nuclear factor kappa-B kinase subunit epsilon
Name:Inhibitor of nuclear factor kappa-B kinase subunit epsilon
Type:Serine/threonine-protein kinase
Mol. Mass.:80475.98
Organism:Homo sapiens (Human)
Description:Kinase inhibitory activity was determined using recombinant human IKK-epsilon expressed in baculovirus as a FLAG-tagged fusion protein.
Residue:716
BDBM278079
NameBDBM278079
Synonyms:(S)-2-((1-acetyl-3,3-difluoropiperidin-4-yl)oxy)-5-(4-((4-(piperidin-4-yl)phenyl)amino)-1,3,5-triazin-2-yl)benzonitrile US10253019, Example 301
TypeSmall organic molecule
Emp. Form.C28H29F2N7O2
Mol. Mass.533.5724
SMILESCC(=O)N1CC[C@H](Oc2ccc(cc2C#N)-c2ncnc(Nc3ccc(cc3)C3CCNCC3)n2)C(F)(F)C1