Reaction Details
TargetBile salt export pump
LigandBDBM86707
Substrate/Competitorn/a
Ki>10000±n/a nM
CommentsPDSP_5735
Citation Hirano, MMaeda, KHayashi, HKusuhara, HSugiyama, Y Bile salt export pump (BSEP/ABCB11) can transport a nonbile acid substrate, pravastatin. J Pharmacol Exp Ther314:876-82 (2005) 
 
Bile salt export pump
Name:Bile salt export pump
Type:Protein
Mol. Mass.:146405.49
Organism:Homo sapiens (Human)
Description:O95342
Residue:1321
BDBM86707
NameBDBM86707
Synonyms:CAS_147511-69-1 | Pitavastatin
TypeSmall organic molecule
Emp. Form.C25H24FNO4
Mol. Mass.421.4608
SMILESO[C@H](C[C@H](O)\C=C\c1c(nc2ccccc2c1-c1ccc(F)cc1)C1CC1)CC(O)=O