Reaction Details
TargetBile salt export pump
LigandBDBM86706
Substrate/Competitorn/a
Ki>10000±n/a nM
CommentsPDSP_5741
Citation Hirano, MMaeda, KHayashi, HKusuhara, HSugiyama, Y Bile salt export pump (BSEP/ABCB11) can transport a nonbile acid substrate, pravastatin. J Pharmacol Exp Ther314:876-82 (2005) 
 
Bile salt export pump
Name:Bile salt export pump
Type:Protein
Mol. Mass.:146405.49
Organism:Homo sapiens (Human)
Description:O95342
Residue:1321
BDBM86706
NameBDBM86706
Synonyms:Pravastatin lactone
TypeSmall organic molecule
Emp. Form.C23H34O6
Mol. Mass.406.5125
SMILESCC[C@H](C)C(=O)O[C@H]1C[C@H](O)C=C2C=C[C@H](C)[C@H](CC[C@@H]3C[C@@H](O)CC(=O)O3)[C@@H]12