Reaction Details
Target5-hydroxytryptamine receptor 5A
LigandBDBM81780
Substrate/Competitorn/a
Ki 1750±n/a nM
CommentsPDSP_1752
Citation Pehek, EANocjar, CRoth, BLByrd, TAMabrouk, OS Evidence for the preferential involvement of 5-HT2A serotonin receptors in stress- and drug-induced dopamine release in the rat medial prefrontal cortex. Neuropsychopharmacology31:265-77 (2006) 
 
5-hydroxytryptamine receptor 5A
Name:5-hydroxytryptamine receptor 5A
Type:Enzyme
Mol. Mass.:40266.25
Organism:Homo sapiens (Human)
Description:P47898
Residue:357
BDBM81780
NameBDBM81780
Synonyms:CAS_6438382 SR 46349B
TypeSmall organic molecule
Emp. Form.C19H21FN2O2
Mol. Mass.328.3806
SMILESCN(C)CCON=C(C=Cc1ccc(O)cc1)c1ccccc1F