Reaction Details
TargetMuscarinic acetylcholine receptor M4
LigandBDBM81780
Substrate/Competitorn/a
Ki 3672±n/a nM
CommentsPDSP_1752
Citation Pehek, EANocjar, CRoth, BLByrd, TAMabrouk, OS Evidence for the preferential involvement of 5-HT2A serotonin receptors in stress- and drug-induced dopamine release in the rat medial prefrontal cortex. Neuropsychopharmacology31:265-77 (2006) 
 
Muscarinic acetylcholine receptor M4
Name:Muscarinic acetylcholine receptor M4
Type:Enzyme Catalytic Domain
Mol. Mass.:53079.31
Organism:Homo sapiens (Human)
Description:Cholinergic, muscarinic M4 CHRM4 HUMAN M3::P08173
Residue:479
BDBM81780
NameBDBM81780
Synonyms:CAS_6438382 SR 46349B
TypeSmall organic molecule
Emp. Form.C19H21FN2O2
Mol. Mass.328.3806
SMILESCN(C)CCON=C(C=Cc1ccc(O)cc1)c1ccccc1F