Reaction Details
TargetMetabotropic glutamate receptor 5
LigandBDBM86716
Substrate/Competitorn/a
Ki 50.8±n/a nM
CommentsPDSP_4884
Citation Porter, RHJaeschke, GSpooren, WBallard, TMBüttelmann, BKolczewski, SPeters, JUPrinssen, EWichmann, JVieira, EMühlemann, AGatti, SMutel, VMalherbe, P Fenobam: a clinically validated nonbenzodiazepine anxiolytic is a potent, selective, and noncompetitive mGlu5 receptor antagonist with inverse agonist activity. J Pharmacol Exp Ther315:711-21 (2005) 
 
Metabotropic glutamate receptor 5
Name:Metabotropic glutamate receptor 5
Type:Enzyme
Mol. Mass.:131900.14
Organism:Rattus norvegicus (Rat)
Description:P31424
Residue:1203
BDBM86716
NameBDBM86716
Synonyms:CAS_63540-28-3 Fenobam | NSC_216215
TypeSmall organic molecule
Emp. Form.C11H11ClN4O2
Mol. Mass.266.684
SMILESCn1cc(O)nc1NC(=O)Nc1cccc(Cl)c1