Reaction Details
TargetMetabotropic glutamate receptor 5
LigandBDBM50002371
Substrate/Competitorn/a
Ki>10000±n/a nM
CommentsPDSP_873
Citation Porter, RHJaeschke, GSpooren, WBallard, TMBüttelmann, BKolczewski, SPeters, JUPrinssen, EWichmann, JVieira, EMühlemann, AGatti, SMutel, VMalherbe, P Fenobam: a clinically validated nonbenzodiazepine anxiolytic is a potent, selective, and noncompetitive mGlu5 receptor antagonist with inverse agonist activity. J Pharmacol Exp Ther315:711-21 (2005) 
 
Metabotropic glutamate receptor 5
Name:Metabotropic glutamate receptor 5
Type:Enzyme
Mol. Mass.:132484.72
Organism:Homo sapiens (Human)
Description:n/a
Residue:1212
BDBM50002371
NameBDBM50002371
Synonyms:2-aminopentanedioic acidglutamic acid Glutamate glutamic acid
TypeSmall organic molecule
Emp. Form.C5H9NO4
Mol. Mass.147.1293
SMILESNC(CCC(O)=O)C(O)=O