Reaction Details
TargetMetabotropic glutamate receptor 5
LigandBDBM50122758
Substrate/Competitorn/a
Ki 5.3±n/a nM
CommentsPDSP_4885
Citation Porter, RHJaeschke, GSpooren, WBallard, TMBüttelmann, BKolczewski, SPeters, JUPrinssen, EWichmann, JVieira, EMühlemann, AGatti, SMutel, VMalherbe, P Fenobam: a clinically validated nonbenzodiazepine anxiolytic is a potent, selective, and noncompetitive mGlu5 receptor antagonist with inverse agonist activity. J Pharmacol Exp Ther315:711-21 (2005) 
 
Metabotropic glutamate receptor 5
Name:Metabotropic glutamate receptor 5
Type:Enzyme
Mol. Mass.:132484.72
Organism:Homo sapiens (Human)
Description:n/a
Residue:1212
BDBM50122758
NameBDBM50122758
Synonyms:2-methyl-4-(pyridin-3-ylethynyl)thiazole 3-(2-Methyl-thiazol-4-ylethynyl)-pyridine 3-[(2-methyl-4-thiazolyl)ethynyl]pyridine MTEP
TypeSmall organic molecule
Emp. Form.C11H8N2S
Mol. Mass.200.26
SMILESCc1nc(cs1)C#Cc1cccnc1