Reaction Details
TargetD(2) dopamine receptor
LigandBDBM86187
Substrate/Competitorn/a
Ki 0.2±n/a nM
CommentsPDSP_1850
Citation Burstein, ESMa, JWong, SGao, YPham, EKnapp, AENash, NROlsson, RDavis, REHacksell, UWeiner, DMBrann, MR Intrinsic efficacy of antipsychotics at human D2, D3, and D4 dopamine receptors: identification of the clozapine metabolite N-desmethylclozapine as a D2/D3 partial agonist. J Pharmacol Exp Ther315:1278-87 (2005) 
 
D(2) dopamine receptor
Name:D(2) dopamine receptor
Type:Cell-surface receptors
Mol. Mass.:50647.10
Organism:Homo sapiens (Human)
Description:P14416
Residue:443
BDBM86187
NameBDBM86187
Synonyms:CAS_22189-31-7 THIOTHIXENE
TypeSmall organic molecule
Emp. Form.C23H29N3O2S2
Mol. Mass.443.625
SMILESCN(C)S(=O)(=O)c1ccc2Sc3ccccc3C(=CCCN3CCN(C)CC3)c2c1